{"text_format":"1","workbook":"xlsx","n_sheets":6,"sheets":["DATA","Suvestinė","1 Darbo užmokestis","2 Išlaidų detalizavimas","Finansavimo intensyvumai","Dienpinigiai ir apgyvendinimas"],"not_rendered":{"charts":0,"images":0,"macros":1,"external_links":0,"defined_names":3,"comments":0,"pivot_tables":0},"unopened":[],"bounds":{"document_bytes":16777216,"sheet_cells":100000,"rows_first":2000,"rows_last":500,"rows_between":2000,"halvings":0,"cell_chars":16384,"cell_head_chars":4096},"cells_cut":0,"cells_raw":0,"read":"whole","date_system":"1900"}

{"sheet":"DATA","index":0,"n_rows":32,"n_cols":15,"rows_kept":32,"cut":false,"hidden":true,"merged":[]}
[null,"Vykdytojo tipas","MT VID. intensyvumas","EP VID. intensyvumas",null,null,null,"Vykdytojo tipas","TIS","FS",null,null,null,"Vykdytojo tipas","Juridinis asmuo"]
[null,"Pareiškėjas",{"$f":"IF(ISERROR(AVERAGEIFS($D$8:$D$32,$C$8:$C$32,B2,$B$8:$B$32,\"Moksliniai tyrimai\")),0,AVERAGEIFS($D$8:$D$32,$C$8:$C$32,B2,$B$8:$B$32,\"Moksliniai tyrimai\"))","v":0},{"$f":"IF(ISERROR(AVERAGEIFS($D$8:$D$32,$C$8:$C$32,B2,$B$8:$B$32,\"Eksperimentinė plėtra\")),0,AVERAGEIFS($D$8:$D$32,$C$8:$C$32,B2,$B$8:$B$32,\"Eksperimentinė plėtra\"))","v":0},null,null,null,"Pareiškėjas",{"$f":"SUMIF($H$8:$H$32,H2,$I$8:$I$32)","v":0},{"$f":"SUMIF($H$8:$H$32,H2,$J$8:$J$32)","v":0},null,null,null,"Pareiškėjas",{"$f":"VLOOKUP(N2,$N$8:$O$32,2,FALSE)","v":{"$error":"#N/A"}}]
[null,"Partneris Nr. 1",{"$f":"IF(ISERROR(AVERAGEIFS($D$8:$D$32,$C$8:$C$32,B3,$B$8:$B$32,\"Moksliniai tyrimai\")),0,AVERAGEIFS($D$8:$D$32,$C$8:$C$32,B3,$B$8:$B$32,\"Moksliniai tyrimai\"))","v":0},{"$f":"IF(ISERROR(AVERAGEIFS($D$8:$D$32,$C$8:$C$32,B3,$B$8:$B$32,\"Eksperimentinė plėtra\")),0,AVERAGEIFS($D$8:$D$32,$C$8:$C$32,B3,$B$8:$B$32,\"Eksperimentinė plėtra\"))","v":0},null,null,null,"Partneris Nr. 1",{"$f":"SUMIF($H$8:$H$32,H3,$I$8:$I$32)","v":0},{"$f":"SUMIF($H$8:$H$32,H3,$J$8:$J$32)","v":0},null,null,null,"Partneris Nr. 1",{"$f":"VLOOKUP(N3,$N$8:$O$32,2,FALSE)","v":{"$error":"#N/A"}}]
[null,"Partneris Nr. 2",0,0,null,null,null,"Partneris Nr. 2",0,0,null,null,null,"Partneris Nr. 2",{"$error":"#N/A"}]
[null,"Partneris Nr. 3",0,0,null,null,null,"Partneris Nr. 3",{"$f":"SUMIF($H$8:$H$32,H5,$I$8:$I$32)","v":0},0,null,null,null,"Partneris Nr. 3",{"$error":"#N/A"}]
[]
["Veiklos Nr.","Veiklos tipas","Vykdytojo tipas","Intensyvumas",null,null,"Veiklos Nr.","Vykdytojo tipas","TIS","FS",null,null,"Veiklos Nr.","Vykdytojo tipas","Juridinis asmuo"]
[1,{"$f":"IF('2 Išlaidų detalizavimas'!#REF!=\"\",\"\",'2 Išlaidų detalizavimas'!#REF!)","v":{"$error":"#REF!"}},{"$f":"IF('2 Išlaidų detalizavimas'!#REF!=\"\",\"\",'2 Išlaidų detalizavimas'!#REF!)","v":{"$error":"#REF!"}},{"$f":"IF('2 Išlaidų detalizavimas'!$D$4=\"\",\"\",'2 Išlaidų detalizavimas'!$D$4)","v":0},null,null,1,{"$f":"IF('2 Išlaidų detalizavimas'!#REF!=\"\",\"\",'2 Išlaidų detalizavimas'!#REF!)","v":{"$error":"#REF!"}},{"$f":"'2 Išlaidų detalizavimas'!#REF!","v":{"$error":"#REF!"}},{"$f":"'2 Išlaidų detalizavimas'!#REF!","v":{"$error":"#REF!"}},null,null,1,{"$f":"IF('2 Išlaidų detalizavimas'!#REF!=\"\",\"\",'2 Išlaidų detalizavimas'!#REF!)","v":{"$error":"#REF!"}},{"$f":"IF('2 Išlaidų detalizavimas'!$D$3=\"\",\"\",'2 Išlaidų detalizavimas'!$D$3)","v":""}]
[2,{"$f":"IF(#REF!=\"\",\"\",#REF!)","v":{"$error":"#REF!"}},{"$f":"IF(#REF!=\"\",\"\",#REF!)","v":{"$error":"#REF!"}},{"$f":"IF(#REF!=\"\",\"\",#REF!)","v":{"$error":"#REF!"}},null,null,2,{"$f":"IF(#REF!=\"\",\"\",#REF!)","v":{"$error":"#REF!"}},{"$f":"#REF!","v":{"$error":"#REF!"}},{"$f":"#REF!","v":{"$error":"#REF!"}},null,null,2,{"$f":"IF(#REF!=\"\",\"\",#REF!)","v":{"$error":"#REF!"}},{"$f":"IF(#REF!=\"\",\"\",#REF!)","v":{"$error":"#REF!"}}]
[3,{"$f":"IF(#REF!=\"\",\"\",#REF!)","v":{"$error":"#REF!"}},{"$f":"IF(#REF!=\"\",\"\",#REF!)","v":{"$error":"#REF!"}},{"$f":"IF(#REF!=\"\",\"\",#REF!)","v":{"$error":"#REF!"}},null,null,3,{"$f":"IF(#REF!=\"\",\"\",#REF!)","v":{"$error":"#REF!"}},{"$f":"#REF!","v":{"$error":"#REF!"}},{"$f":"#REF!","v":{"$error":"#REF!"}},null,null,3,{"$f":"IF(#REF!=\"\",\"\",#REF!)","v":{"$error":"#REF!"}},{"$f":"IF(#REF!=\"\",\"\",#REF!)","v":{"$error":"#REF!"}}]
[4,{"$f":"IF(#REF!=\"\",\"\",#REF!)","v":{"$error":"#REF!"}},{"$f":"IF(#REF!=\"\",\"\",#REF!)","v":{"$error":"#REF!"}},{"$f":"IF(#REF!=\"\",\"\",#REF!)","v":{"$error":"#REF!"}},null,null,4,{"$f":"IF(#REF!=\"\",\"\",#REF!)","v":{"$error":"#REF!"}},{"$f":"#REF!","v":{"$error":"#REF!"}},{"$f":"#REF!","v":{"$error":"#REF!"}},null,null,4,{"$f":"IF(#REF!=\"\",\"\",#REF!)","v":{"$error":"#REF!"}},{"$f":"IF(#REF!=\"\",\"\",#REF!)","v":{"$error":"#REF!"}}]
[5,{"$f":"IF(#REF!=\"\",\"\",#REF!)","v":{"$error":"#REF!"}},{"$f":"IF(#REF!=\"\",\"\",#REF!)","v":{"$error":"#REF!"}},{"$f":"IF(#REF!=\"\",\"\",#REF!)","v":{"$error":"#REF!"}},null,null,5,{"$f":"IF(#REF!=\"\",\"\",#REF!)","v":{"$error":"#REF!"}},{"$f":"#REF!","v":{"$error":"#REF!"}},{"$f":"#REF!","v":{"$error":"#REF!"}},null,null,5,{"$f":"IF(#REF!=\"\",\"\",#REF!)","v":{"$error":"#REF!"}},{"$f":"IF(#REF!=\"\",\"\",#REF!)","v":{"$error":"#REF!"}}]
[6,{"$f":"IF(#REF!=\"\",\"\",#REF!)","v":{"$error":"#REF!"}},{"$f":"IF(#REF!=\"\",\"\",#REF!)","v":{"$error":"#REF!"}},{"$f":"IF(#REF!=\"\",\"\",#REF!)","v":{"$error":"#REF!"}},null,null,6,{"$f":"IF(#REF!=\"\",\"\",#REF!)","v":{"$error":"#REF!"}},{"$f":"#REF!","v":{"$error":"#REF!"}},{"$f":"#REF!","v":{"$error":"#REF!"}},null,null,6,{"$f":"IF(#REF!=\"\",\"\",#REF!)","v":{"$error":"#REF!"}},{"$f":"IF(#REF!=\"\",\"\",#REF!)","v":{"$error":"#REF!"}}]
[7,{"$f":"IF(#REF!=\"\",\"\",#REF!)","v":{"$error":"#REF!"}},{"$f":"IF(#REF!=\"\",\"\",#REF!)","v":{"$error":"#REF!"}},{"$f":"IF(#REF!=\"\",\"\",#REF!)","v":{"$error":"#REF!"}},null,null,7,{"$f":"IF(#REF!=\"\",\"\",#REF!)","v":{"$error":"#REF!"}},{"$f":"#REF!","v":{"$error":"#REF!"}},{"$f":"#REF!","v":{"$error":"#REF!"}},null,null,7,{"$f":"IF(#REF!=\"\",\"\",#REF!)","v":{"$error":"#REF!"}},{"$f":"IF(#REF!=\"\",\"\",#REF!)","v":{"$error":"#REF!"}}]
[8,{"$f":"IF(#REF!=\"\",\"\",#REF!)","v":{"$error":"#REF!"}},{"$f":"IF(#REF!=\"\",\"\",#REF!)","v":{"$error":"#REF!"}},{"$f":"IF(#REF!=\"\",\"\",#REF!)","v":{"$error":"#REF!"}},null,null,8,{"$f":"IF(#REF!=\"\",\"\",#REF!)","v":{"$error":"#REF!"}},{"$f":"#REF!","v":{"$error":"#REF!"}},{"$f":"#REF!","v":{"$error":"#REF!"}},null,null,8,{"$f":"IF(#REF!=\"\",\"\",#REF!)","v":{"$error":"#REF!"}},{"$f":"IF(#REF!=\"\",\"\",#REF!)","v":{"$error":"#REF!"}}]
[9,{"$f":"IF(#REF!=\"\",\"\",#REF!)","v":{"$error":"#REF!"}},{"$f":"IF(#REF!=\"\",\"\",#REF!)","v":{"$error":"#REF!"}},{"$f":"IF(#REF!=\"\",\"\",#REF!)","v":{"$error":"#REF!"}},null,null,9,{"$f":"IF(#REF!=\"\",\"\",#REF!)","v":{"$error":"#REF!"}},{"$f":"#REF!","v":{"$error":"#REF!"}},{"$f":"#REF!","v":{"$error":"#REF!"}},null,null,9,{"$f":"IF(#REF!=\"\",\"\",#REF!)","v":{"$error":"#REF!"}},{"$f":"IF(#REF!=\"\",\"\",#REF!)","v":{"$error":"#REF!"}}]
[10,{"$f":"IF(#REF!=\"\",\"\",#REF!)","v":{"$error":"#REF!"}},{"$f":"IF(#REF!=\"\",\"\",#REF!)","v":{"$error":"#REF!"}},{"$f":"IF(#REF!=\"\",\"\",#REF!)","v":{"$error":"#REF!"}},null,null,10,{"$f":"IF(#REF!=\"\",\"\",#REF!)","v":{"$error":"#REF!"}},{"$f":"#REF!","v":{"$error":"#REF!"}},{"$f":"#REF!","v":{"$error":"#REF!"}},null,null,10,{"$f":"IF(#REF!=\"\",\"\",#REF!)","v":{"$error":"#REF!"}},{"$f":"IF(#REF!=\"\",\"\",#REF!)","v":{"$error":"#REF!"}}]
[11,{"$f":"IF(#REF!=\"\",\"\",#REF!)","v":{"$error":"#REF!"}},{"$f":"IF(#REF!=\"\",\"\",#REF!)","v":{"$error":"#REF!"}},{"$f":"IF(#REF!=\"\",\"\",#REF!)","v":{"$error":"#REF!"}},null,null,11,{"$f":"IF(#REF!=\"\",\"\",#REF!)","v":{"$error":"#REF!"}},{"$f":"#REF!","v":{"$error":"#REF!"}},{"$f":"#REF!","v":{"$error":"#REF!"}},null,null,11,{"$f":"IF(#REF!=\"\",\"\",#REF!)","v":{"$error":"#REF!"}},{"$f":"IF(#REF!=\"\",\"\",#REF!)","v":{"$error":"#REF!"}}]
[12,{"$f":"IF(#REF!=\"\",\"\",#REF!)","v":{"$error":"#REF!"}},{"$f":"IF(#REF!=\"\",\"\",#REF!)","v":{"$error":"#REF!"}},{"$f":"IF(#REF!=\"\",\"\",#REF!)","v":{"$error":"#REF!"}},null,null,12,{"$f":"IF(#REF!=\"\",\"\",#REF!)","v":{"$error":"#REF!"}},{"$f":"#REF!","v":{"$error":"#REF!"}},{"$f":"#REF!","v":{"$error":"#REF!"}},null,null,12,{"$f":"IF(#REF!=\"\",\"\",#REF!)","v":{"$error":"#REF!"}},{"$f":"IF(#REF!=\"\",\"\",#REF!)","v":{"$error":"#REF!"}}]
[13,{"$f":"IF(#REF!=\"\",\"\",#REF!)","v":{"$error":"#REF!"}},{"$f":"IF(#REF!=\"\",\"\",#REF!)","v":{"$error":"#REF!"}},{"$f":"IF(#REF!=\"\",\"\",#REF!)","v":{"$error":"#REF!"}},null,null,13,{"$f":"IF(#REF!=\"\",\"\",#REF!)","v":{"$error":"#REF!"}},{"$f":"#REF!","v":{"$error":"#REF!"}},{"$f":"#REF!","v":{"$error":"#REF!"}},null,null,13,{"$f":"IF(#REF!=\"\",\"\",#REF!)","v":{"$error":"#REF!"}},{"$f":"IF(#REF!=\"\",\"\",#REF!)","v":{"$error":"#REF!"}}]
{"$rows_left_out":13}
{"sheet":"Suvestinė","index":1,"n_rows":29,"n_cols":10,"rows_kept":29,"cut":false,"hidden":false,"merged":[[20,0,20,5],[23,0,23,7],[26,0,26,7],[1,0,1,9],[2,0,2,9],[22,0,22,9]]}
[]
["PROJEKTO BIUDŽETO SUVESTINĖ"]
["(lentelė užpildoma automatiškai)"]
[]
["Renginio Nr.","Renginio pavadinimas","Renginio šalis","Išvykimo į renginį data","Grįžimo iš renginio data","Komandiruotės trukmė, d.","Darbo užmokesčio išlaidos, Eur","Komandiruočių išlaidos, Eur","IŠ VISO renginių išlaidos, Eur","Finansavimo suma, Eur"]
[1,{"$f":"'2 Išlaidų detalizavimas'!D9","v":0},{"$f":"'2 Išlaidų detalizavimas'!D11","v":0},{"$f":"IF(AND($B6>0,'2 Išlaidų detalizavimas'!D13>0),'2 Išlaidų detalizavimas'!D13,\"\")","v":""},{"$f":"IF(AND($B6>0,'2 Išlaidų detalizavimas'!H13>0),'2 Išlaidų detalizavimas'!H13,\"\")","v":""},{"$f":"IFERROR(IF(AND(D6>0,E6>0),E6-D6+1,),0)","v":0},{"$f":"'2 Išlaidų detalizavimas'!G15","v":0},{"$f":"'2 Išlaidų detalizavimas'!G30","v":0},{"$f":"'2 Išlaidų detalizavimas'!G31","v":0},{"$f":"'2 Išlaidų detalizavimas'!H31","v":0}]
[2,{"$f":"'2 Išlaidų detalizavimas'!D33","v":0},{"$f":"'2 Išlaidų detalizavimas'!D35","v":0},{"$f":"IF(AND(B7>0,'2 Išlaidų detalizavimas'!D37>0),'2 Išlaidų detalizavimas'!D37,\"\")","v":""},{"$f":"IF(AND($B7>0,'2 Išlaidų detalizavimas'!H37>0),'2 Išlaidų detalizavimas'!H37,\"\")","v":""},{"$f":"IFERROR(IF(AND(D7>0,E7>0),E7-D7+1,),0)","v":0},{"$f":"'2 Išlaidų detalizavimas'!G39","v":0},{"$f":"'2 Išlaidų detalizavimas'!G54","v":0},{"$f":"'2 Išlaidų detalizavimas'!G55","v":0},{"$f":"'2 Išlaidų detalizavimas'!H55","v":0}]
[3,{"$f":"'2 Išlaidų detalizavimas'!D57","v":0},{"$f":"'2 Išlaidų detalizavimas'!D59","v":0},{"$f":"IF(AND(B8>0,'2 Išlaidų detalizavimas'!D61>0),'2 Išlaidų detalizavimas'!D61,\"\")","v":""},{"$f":"IF(AND(B8>0,'2 Išlaidų detalizavimas'!H61>0),'2 Išlaidų detalizavimas'!H61,\"\")","v":""},0,{"$f":"'2 Išlaidų detalizavimas'!G63","v":0},{"$f":"'2 Išlaidų detalizavimas'!G78","v":0},{"$f":"'2 Išlaidų detalizavimas'!G79","v":0},{"$f":"'2 Išlaidų detalizavimas'!H79","v":0}]
[4,{"$f":"'2 Išlaidų detalizavimas'!D81","v":0},{"$f":"'2 Išlaidų detalizavimas'!D83","v":0},{"$f":"IF(AND(B9>0,'2 Išlaidų detalizavimas'!D85>0),'2 Išlaidų detalizavimas'!D85,\"\")","v":""},{"$f":"IF(AND(B9>0,'2 Išlaidų detalizavimas'!H85>0),'2 Išlaidų detalizavimas'!H85,\"\")","v":""},0,{"$f":"'2 Išlaidų detalizavimas'!G87","v":0},{"$f":"'2 Išlaidų detalizavimas'!G102","v":0},{"$f":"'2 Išlaidų detalizavimas'!G103","v":0},{"$f":"'2 Išlaidų detalizavimas'!H103","v":0}]
[5,{"$f":"'2 Išlaidų detalizavimas'!D105","v":0},{"$f":"'2 Išlaidų detalizavimas'!D107","v":0},{"$f":"IF(AND(B10>0,'2 Išlaidų detalizavimas'!D109>0),'2 Išlaidų detalizavimas'!D109,\"\")","v":""},{"$f":"IF(AND(B10>0,'2 Išlaidų detalizavimas'!H109>0),'2 Išlaidų detalizavimas'!H109,\"\")","v":""},0,{"$f":"'2 Išlaidų detalizavimas'!G111","v":0},{"$f":"'2 Išlaidų detalizavimas'!G126","v":0},{"$f":"'2 Išlaidų detalizavimas'!G127","v":0},{"$f":"'2 Išlaidų detalizavimas'!H127","v":0}]
[6,{"$f":"'2 Išlaidų detalizavimas'!D129","v":0},{"$f":"'2 Išlaidų detalizavimas'!D131","v":0},{"$f":"IF(AND(B11>0,'2 Išlaidų detalizavimas'!D133>0),'2 Išlaidų detalizavimas'!D133,\"\")","v":""},{"$f":"IF(AND(B11>0,'2 Išlaidų detalizavimas'!H133>0),'2 Išlaidų detalizavimas'!H133,\"\")","v":""},0,{"$f":"'2 Išlaidų detalizavimas'!G135","v":0},{"$f":"'2 Išlaidų detalizavimas'!G150","v":0},{"$f":"'2 Išlaidų detalizavimas'!G151","v":0},{"$f":"'2 Išlaidų detalizavimas'!H151","v":0}]
[7,{"$f":"'2 Išlaidų detalizavimas'!D153","v":0},{"$f":"'2 Išlaidų detalizavimas'!D155","v":0},{"$f":"IF(AND(B12>0,'2 Išlaidų detalizavimas'!D157>0),'2 Išlaidų detalizavimas'!D157,\"\")","v":""},{"$f":"IF(AND(B12>0,'2 Išlaidų detalizavimas'!H157>0),'2 Išlaidų detalizavimas'!H157,\"\")","v":""},0,{"$f":"'2 Išlaidų detalizavimas'!G159","v":0},{"$f":"'2 Išlaidų detalizavimas'!G174","v":0},{"$f":"'2 Išlaidų detalizavimas'!G175","v":0},{"$f":"'2 Išlaidų detalizavimas'!H175","v":0}]
[8,{"$f":"'2 Išlaidų detalizavimas'!D177","v":0},{"$f":"'2 Išlaidų detalizavimas'!D179","v":0},{"$f":"IF(AND(B13>0,'2 Išlaidų detalizavimas'!D181>0),'2 Išlaidų detalizavimas'!D181,\"\")","v":""},{"$f":"IF(AND(B13>0,'2 Išlaidų detalizavimas'!H181>0),'2 Išlaidų detalizavimas'!H181,\"\")","v":""},0,{"$f":"'2 Išlaidų detalizavimas'!G183","v":0},{"$f":"'2 Išlaidų detalizavimas'!G198","v":0},{"$f":"'2 Išlaidų detalizavimas'!G199","v":0},{"$f":"'2 Išlaidų detalizavimas'!H199","v":0}]
[9,{"$f":"'2 Išlaidų detalizavimas'!D201","v":0},{"$f":"'2 Išlaidų detalizavimas'!D203","v":0},{"$f":"IF(AND(B14>0,'2 Išlaidų detalizavimas'!D205>0),'2 Išlaidų detalizavimas'!D205,\"\")","v":""},{"$f":"IF(AND(B14>0,'2 Išlaidų detalizavimas'!H205>0),'2 Išlaidų detalizavimas'!H205,\"\")","v":""},0,{"$f":"'2 Išlaidų detalizavimas'!G207","v":0},{"$f":"'2 Išlaidų detalizavimas'!G222","v":0},{"$f":"'2 Išlaidų detalizavimas'!G223","v":0},{"$f":"'2 Išlaidų detalizavimas'!H223","v":0}]
[10,{"$f":"'2 Išlaidų detalizavimas'!D225","v":0},{"$f":"'2 Išlaidų detalizavimas'!D227","v":0},{"$f":"IF(AND(B15>0,'2 Išlaidų detalizavimas'!D229>0),'2 Išlaidų detalizavimas'!D229,\"\")","v":""},{"$f":"IF(AND(B15>0,'2 Išlaidų detalizavimas'!H229>0),'2 Išlaidų detalizavimas'!H229,\"\")","v":""},0,{"$f":"'2 Išlaidų detalizavimas'!G231","v":0},{"$f":"'2 Išlaidų detalizavimas'!G246","v":0},{"$f":"'2 Išlaidų detalizavimas'!G247","v":0},{"$f":"'2 Išlaidų detalizavimas'!H247","v":0}]
[11,{"$f":"'2 Išlaidų detalizavimas'!D249","v":0},{"$f":"'2 Išlaidų detalizavimas'!D251","v":0},{"$f":"IF(AND(B16>0,'2 Išlaidų detalizavimas'!D253>0),'2 Išlaidų detalizavimas'!D253,\"\")","v":""},{"$f":"IF(AND(B16>0,'2 Išlaidų detalizavimas'!H253>0),'2 Išlaidų detalizavimas'!H253,\"\")","v":""},0,{"$f":"'2 Išlaidų detalizavimas'!G255","v":0},{"$f":"'2 Išlaidų detalizavimas'!G270","v":0},{"$f":"'2 Išlaidų detalizavimas'!G271","v":0},{"$f":"'2 Išlaidų detalizavimas'!H271","v":0}]
[12,{"$f":"'2 Išlaidų detalizavimas'!D273","v":0},{"$f":"'2 Išlaidų detalizavimas'!D275","v":0},{"$f":"IF(AND(B17>0,'2 Išlaidų detalizavimas'!D277>0),'2 Išlaidų detalizavimas'!D277,\"\")","v":""},{"$f":"IF(AND(B17>0,'2 Išlaidų detalizavimas'!H277>0),'2 Išlaidų detalizavimas'!H277,\"\")","v":""},0,{"$f":"'2 Išlaidų detalizavimas'!G279","v":0},{"$f":"'2 Išlaidų detalizavimas'!G294","v":0},{"$f":"'2 Išlaidų detalizavimas'!G295","v":0},{"$f":"'2 Išlaidų detalizavimas'!H295","v":0}]
[13,{"$f":"'2 Išlaidų detalizavimas'!D297","v":0},{"$f":"'2 Išlaidų detalizavimas'!D299","v":0},{"$f":"IF(AND(B18>0,'2 Išlaidų detalizavimas'!D301>0),'2 Išlaidų detalizavimas'!D301,\"\")","v":""},{"$f":"IF(AND(B18>0,'2 Išlaidų detalizavimas'!H301>0),'2 Išlaidų detalizavimas'!H301,\"\")","v":""},0,{"$f":"'2 Išlaidų detalizavimas'!G303","v":0},{"$f":"'2 Išlaidų detalizavimas'!G318","v":0},{"$f":"'2 Išlaidų detalizavimas'!G319","v":0},{"$f":"'2 Išlaidų detalizavimas'!H319","v":0}]
[14,{"$f":"'2 Išlaidų detalizavimas'!D321","v":0},{"$f":"'2 Išlaidų detalizavimas'!D323","v":0},{"$f":"IF(AND(B19>0,'2 Išlaidų detalizavimas'!D325>0),'2 Išlaidų detalizavimas'!D325,\"\")","v":""},{"$f":"IF(AND(B19>0,'2 Išlaidų detalizavimas'!H325>0),'2 Išlaidų detalizavimas'!H325,\"\")","v":""},0,{"$f":"'2 Išlaidų detalizavimas'!G327","v":0},{"$f":"'2 Išlaidų detalizavimas'!G342","v":0},{"$f":"'2 Išlaidų detalizavimas'!G343","v":0},{"$f":"'2 Išlaidų detalizavimas'!H343","v":0}]
[15,{"$f":"'2 Išlaidų detalizavimas'!D345","v":0},{"$f":"'2 Išlaidų detalizavimas'!D347","v":0},{"$f":"IF(AND(B20>0,'2 Išlaidų detalizavimas'!D349>0),'2 Išlaidų detalizavimas'!D349,\"\")","v":""},{"$f":"IF(AND(B20>0,'2 Išlaidų detalizavimas'!H349>0),'2 Išlaidų detalizavimas'!H349,\"\")","v":""},0,{"$f":"'2 Išlaidų detalizavimas'!G351","v":0},{"$f":"'2 Išlaidų detalizavimas'!G366","v":0},{"$f":"'2 Išlaidų detalizavimas'!G367","v":0},{"$f":"'2 Išlaidų detalizavimas'!H367","v":0}]
{"$rows_left_out":10}
{"sheet":"1 Darbo užmokestis","index":2,"n_rows":16,"n_cols":5,"rows_kept":16,"cut":false,"hidden":false,"merged":[[3,0,3,4],[1,0,1,4]]}
[]
["INFORMACIJA APIE PRISKAITYTĄ IR IŠMOKĖTĄ DARBO UŽMOKESTĮ     "]
[]
["Žemiau esančioje lentelėje įrašykite tuos įmonės darbuotojus, kurie vyks į projekte numatytus renginius."]
[]
["Nr.","Vardas, pavardė","Pareigos","Faktiškai gaunamas darbo užmokestis už 1 val. pagal praėjusių 6 mėn. vidurkį, Eur","Išlaidų pagrindimo dokumentų pavadinimas, data ir Nr."]
["1"]
["2"]
["3"]
["4"]
["5"]
["6"]
["7"]
["8"]
["9"]
["10"]

{"sheet":"2 Išlaidų detalizavimas","index":3,"n_rows":367,"n_cols":10,"rows_kept":367,"cut":false,"hidden":false,"merged":[[71,0,75,0],[71,1,75,1],[346,3,346,7],[8,3,8,8],[13,4,13,8],[14,1,14,5],[20,1,20,5],[21,1,21,2],[2,3,2,5],[28,1,28,2],[12,4,12,6],[11,4,11,6],[8,0,13,1],[22,1,22,2],[5,1,5,2],[2,0,2,2],[38,1,38,5],[44,1,44,5],[45,1,45,2],[46,1,46,2],[29,1,29,2],[32,0,37,1],[32,3,32,8],[35,4,35,6],[37,4,37,8],[30,0,30,5],[34,3,34,7],[62,1,62,5],[68,1,68,5],[69,1,69,2],[70,1,70,2],[52,1,52,2],[53,1,53,2],[54,0,54,5],[56,0,61,1],[56,3,56,8],[59,4,59,6],[60,4,60,6],[61,4,61,8],[58,3,58,7],[47,0,51,0],[47,1,51,1],[36,4,36,6],[119,0,123,0],[119,1,123,1],[86,1,86,5],[92,1,92,5],[93,1,93,2],[94,1,94,2],[76,1,76,2],[77,1,77,2],[78,0,78,5],[80,0,85,1],[80,3,80,8],[83,4,83,6],[84,4,84,6],[85,4,85,8],[82,3,82,7],[95,0,99,0],[95,1,99,1],[110,1,110,5],[116,1,116,5],[117,1,117,2],[118,1,118,2],[100,1,100,2],[101,1,101,2],[102,0,102,5],[104,0,109,1],[104,3,104,8],[107,4,107,6],[108,4,108,6],[109,4,109,8],[106,3,106,7],[167,0,171,0],[167,1,171,1],[134,1,134,5],[140,1,140,5],[141,1,141,2],[142,1,142,2],[124,1,124,2],[125,1,125,2],[126,0,126,5],[128,0,133,1],[128,3,128,8],[131,4,131,6],[132,4,132,6],[133,4,133,8],[130,3,130,7],[143,0,147,0],[143,1,147,1],[158,1,158,5],[164,1,164,5],[165,1,165,2],[166,1,166,2],[148,1,148,2],[149,1,149,2],[150,0,150,5],[152,0,157,1],[152,3,152,8],[155,4,155,6],[156,4,156,6],[157,4,157,8],[154,3,154,7],[215,0,219,0],[215,1,219,1],[182,1,182,5],[188,1,188,5],[189,1,189,2],[190,1,190,2],[172,1,172,2],[173,1,173,2],[174,0,174,5],[176,0,181,1],[176,3,176,8],[179,4,179,6],[180,4,180,6],[181,4,181,8],[178,3,178,7],[191,0,195,0],[191,1,195,1],[206,1,206,5],[212,1,212,5],[213,1,213,2],[214,1,214,2],[196,1,196,2],[197,1,197,2],[198,0,198,5],[200,0,205,1],[200,3,200,8],[203,4,203,6],[204,4,204,6],[205,4,205,8],[202,3,202,7],[263,0,267,0],[263,1,267,1],[230,1,230,5],[236,1,236,5],[237,1,237,2],[238,1,238,2],[220,1,220,2],[221,1,221,2],[222,0,222,5],[224,0,229,1],[224,3,224,8],[227,4,227,6],[228,4,228,6],[229,4,229,8],[226,3,226,7],[239,0,243,0],[239,1,243,1],[254,1,254,5],[260,1,260,5],[261,1,261,2],[262,1,262,2],[244,1,244,2],[245,1,245,2],[246,0,246,5],[248,0,253,1],[248,3,248,8],[251,4,251,6],[252,4,252,6],[253,4,253,8],[250,3,250,7],[268,1,268,2],[269,1,269,2],[270,0,270,5],[272,0,277,1],[272,3,272,8],[275,4,275,6],[276,4,276,6],[277,4,277,8],[274,3,274,7],[299,4,299,6],[300,4,300,6],[301,4,301,8],[298,3,298,7],[311,0,315,0],[311,1,315,1],[278,1,278,5],[284,1,284,5],[285,1,285,2],[286,1,286,2],[287,0,291,0],[287,1,291,1],[366,0,366,5],[6,0,6,5],[350,1,350,5],[356,1,356,5],[357,1,357,2],[358,1,358,2],[340,1,340,2],[341,1,341,2],[342,0,342,5],[344,0,349,1],[344,3,344,8],[347,4,347,6],[348,4,348,6],[349,4,349,8],[326,1,326,5],[332,1,332,5],[10,3,10,7],[333,1,333,2],[334,1,334,2],[316,1,316,2],[317,1,317,2],[318,0,318,5],[320,0,325,1],[320,3,320,8],[359,0,363,0],[359,1,363,1],[15,8,17,8],[23,1,27,1],[23,0,27,0],[0,0,0,2],[0,3,0,8],[364,1,364,2],[365,1,365,2],[323,4,323,6],[324,4,324,6],[325,4,325,8],[322,3,322,7],[335,0,339,0],[335,1,339,1],[302,1,302,5],[308,1,308,5],[309,1,309,2],[310,1,310,2],[292,1,292,2],[293,1,293,2],[294,0,294,5],[296,0,301,1],[296,3,296,8]]}
["Pareiškėjo pavadinimas:"]
[null,null,"Renginių kiekis, vnt.:"]
["Regionas, pasirinkite iš sąrašo:"]
[null,null,"Finansuojamoji dalis:",{"$f":"IF(D3>0,VLOOKUP(D3,'Finansavimo intensyvumai'!A1:B2,2,FALSE),0%)","v":0}]
[]
["Nr.","Išlaidų pavadinimas",null,"Matavimo vnt.","Kiekis","Vieneto kaina be PVM, Eur","Tinkamų finansuoti išlaidų suma be PVM, Eur","Finansavimo suma, Eur","Komentarai ir išlaidų pagrindimo dokumentų pavadinimas, data ir Nr."]
["IŠ VISO:",null,null,null,null,null,{"$f":"G31+G55+G79+G103+G127+G151+G175+G199+G223+G247+G271+G295+G319+G343+G367","v":0},{"$f":"H31+H55+H79+H103+H127+H151+H175+H199+H223+H247+H271+H295+H319+H343+H367","v":0}]
[]
["1 RENGINYS",null,"Renginio pavadinimas:"]
[null,null,"Renginio nuoroda internete:"]
[null,null,"Renginio šalis, pasirinkite iš sąrašo:"]
[null,null,"Renginio pradžios data:",null,"Renginio pabaigos data:",null,null,null,"Renginio trukmė dienomis:",{"$f":"IF(AND(D12>0,H12>0),H12-D12+1,)","v":0}]
[null,null,"Išvykimo į renginį data:",null,"Grįžimo iš renginio data:",null,null,null,"Komandiruotės trukmė dienomis:",{"$f":"IF(AND(D13>0,H13>0),H13-D13+1,)","v":0}]
[null,null,"Į renginį vykstančių asmenų skaičius:"]
["1.1","Projektą vykdančio personalo darbo užmokesčio išlaidos komandiruotės laikotarpiu",null,null,null,null,{"$f":"SUM(G16:G20)","v":0},{"$f":"SUM(H16:H20)","v":0}]
["1.1.1",null,{"$f":"IF(B16>0,VLOOKUP(B16,'1 Darbo užmokestis'!B$7:C$16,2,FALSE),\"\")","v":""},"val.",{"$f":"J$13*8","v":0},{"$f":"IF(B16>0,ROUND(VLOOKUP(B16,'1 Darbo užmokestis'!B$7:D$16,3,FALSE),2),0)","v":0},{"$f":"ROUND(E16*F16,2)","v":0},{"$f":"ROUND(G16*$D$4,2)","v":0},"Kad galėtumėte pasirinkti darbuotojus, pirmiausia užpildykite lapą „Darbo užmokestis“"]
["1.1.2",null,{"$f":"IF(B17>0,VLOOKUP(B17,'1 Darbo užmokestis'!B$7:C$16,2,FALSE),\"\")","v":""},"val.",{"$f":"J$13*8","v":0},{"$f":"IF(B17>0,ROUND(VLOOKUP(B17,'1 Darbo užmokestis'!B$7:D$16,3,FALSE),2),0)","v":0},{"$f":"ROUND(E17*F17,2)","v":0},{"$f":"ROUND(G17*$D$4,2)","v":0}]
["1.1.3",null,{"$f":"IF(B18>0,VLOOKUP(B18,'1 Darbo užmokestis'!B$7:C$16,2,FALSE),\"\")","v":""},"val.",0,{"$f":"IF(B18>0,ROUND(VLOOKUP(B18,'1 Darbo užmokestis'!B$7:D$16,3,FALSE),2),0)","v":0},{"$f":"ROUND(E18*F18,2)","v":0},{"$f":"ROUND(G18*$D$4,2)","v":0}]
["1.1.4",null,{"$f":"IF(B19>0,VLOOKUP(B19,'1 Darbo užmokestis'!B$7:C$16,2,FALSE),\"\")","v":""},"val.",0,{"$f":"IF(B19>0,ROUND(VLOOKUP(B19,'1 Darbo užmokestis'!B$7:D$16,3,FALSE),2),0)","v":0},0,{"$f":"ROUND(G19*$D$4,2)","v":0}]
["1.1.5",null,{"$f":"IF(B20>0,VLOOKUP(B20,'1 Darbo užmokestis'!B$7:C$16,2,FALSE),\"\")","v":""},"val.",0,{"$f":"IF(B20>0,ROUND(VLOOKUP(B20,'1 Darbo užmokestis'!B$7:D$16,3,FALSE),2),0)","v":0},0,0]
{"$rows_left_out":348}
{"sheet":"Finansavimo intensyvumai","index":4,"n_rows":2,"n_cols":2,"rows_kept":2,"cut":false,"hidden":true,"merged":[]}
["Sostinės regionas",0.5]
["Vidurio ir vakarų Lietuvos regionas",0.85]

{"sheet":"Dienpinigiai ir apgyvendinimas","index":5,"n_rows":150,"n_cols":3,"rows_kept":150,"cut":false,"hidden":false,"merged":[[0,0,0,2]]}
["Dienpinigų ir gyvenamojo plotonuomos normos, \npatvirtintos Lietuvos Respublikos Vyriausybės 2004 m. balandžio 29 d. nutarimu Nr. 526 „Dėl dienpinigių ir kitų komandiruočių išlaidų apmokėjimo“"]
["Valstybės","Gyvenamojo ploto nuomos išlaidų 1 dienos norma, Eur","1 dienos dienpinigių dydis, Eur"]
["Afganistano Islamo Respublika",147,33]
["Airija",174,69]
["Albanijos Respublika",110,33]
["Alžyro Liaudies Demokratinė Respublika",240,57]
["Andoros Kunigaikštystė",103,46]
["Angolos Respublika",382,70]
["Argentinos Respublika",210,50]
["Armėnijos Respublika",210,47]
["Australija",220,50]
["Austrijos Respublika",174,63]
["Azerbaidžano Respublika",200,47]
["Bahamų Sandrauga",174,50]
["Bahreino Karalystė",195,53]
["Baltarusijos Respublika",116,60]
["Bangladešo Liaudies  Respublika",145,33]
["Belgijos Karalystė",197,61]
["Bosnija ir Hercegovina",154,43]
["Botsvanos Respublika",231,33]
{"$rows_left_out":130}